How you resolved:
Code:
frameworks/base/media/libstagefright/ACodec.cpp:172: error: expected primary-expression before 'struct'
frameworks/base/media/libstagefright/ACodec.cpp:172: error: expected ',' or ';' before 'struct'
frameworks/base/media/libstagefright/ACodec.cpp:3006: error: expected '}' at end of input
make: *** [out/target/product/liberty/obj/SHARED_LIBRARIES/libstagefright_intermediates/ACodec.o] Error 1
Do you want to post your ACodec.cpp