FORUMS

Make Your Network Smart – XDA Xposed Tuesday

We rave about the features and abilities of our smartphones. However, in order for … more

Dr.Ketan Brings The S6 Theme Store To The Note 4

Dr.Ketan has submitted a video to the forums showing a functional port of the Galaxy S6 … more

Do You Have Insurance on Your Smartphone?

While affordable smartphones are becoming more available, the majority of high-end flagships … more

Apple Music Will Increase iTunes Match to 100,000 Songs

The battle for music streaming subscription dominance is starting to really heat … more

[GUIDE][HOW TO]Compile S5670 kernel with many Features :D

266 posts
Thanks Meter: 473
 
By zcop, Senior Member on 27th January 2012, 11:25 AM
Post Reply Subscribe to Thread Email Thread
1st May 2012, 04:30 PM |#231  
OP Senior Member
Flag Hanoi
Thanks Meter: 473
 
Donate to Me
More
Quote:
Originally Posted by pratyush.creed

Wifi error in this too!! :»

But my phone wifi work fine. May be you should replace all module with module on other firmware then make kernel base on that firmware

Attached Thumbnails
Click image for larger version

Name:	A.png
Views:	293
Size:	18.1 KB
ID:	1034767   Click image for larger version

Name:	V.png
Views:	294
Size:	18.1 KB
ID:	1034768  
Last edited by zcop; 1st May 2012 at 04:35 PM.
The Following User Says Thank You to zcop For This Useful Post: [ View ]
 
 
DQiB
1st May 2012, 10:38 PM |#232  
Guest
Thanks Meter: 0
 
More
wtf how u setup the damn things
i cant extract boot.img -.-
My code:

alexander@ubuntu:~$ su cd /home/alexander/android/boot.img-tools
Unknown id: cd
alexander@ubuntu:~$ cd /home/alexander/android/boot.img-tools
alexander@ubuntu:~/android/boot.img-tools$ sudo mkdir -p unpack
[sudo] password for alexander:
Sorry, try again.
[sudo] password for alexander:
alexander@ubuntu:~/android/boot.img-tools$ tools/unpackbootimg -i source_img/boot.img -o unpack
bash: tools/unpackbootimg: No such file or directory
alexander@ubuntu:~/android/boot.img-tools$


I dont know what i make wrong i install clean ubuntu 11.10 x64
follow ur complete guide and this error? i dont want anymore -.-
EDIT: Got it with unpacking boot.img using Cygwin and my own mkbootfs or something like that
and unpacking boot.img-ramdisk.gz using ubuntu
Last edited by DQiB; 2nd May 2012 at 12:29 AM.
2nd May 2012, 02:15 AM |#233  
OP Senior Member
Flag Hanoi
Thanks Meter: 473
 
Donate to Me
More
yep i dont know why some PC has that problem
Last edited by zcop; 2nd May 2012 at 02:17 AM.
2nd May 2012, 08:46 AM |#234  
Senior Member
Flag Berlin
Thanks Meter: 40
 
More
Quote:
Originally Posted by zcop

yep i dont know why some PC has that problem

Install and work with linux-dis: DEBIAN!
There is no prob and compiling runs well. Ubuntu has some special files and rules and is no clean LINUX.
DQiB
7th May 2012, 09:41 PM |#235  
Guest
Thanks Meter: 0
 
More
lol error:


Code:
 HOSTCC  scripts/basic/fixdep
  HOSTCC  scripts/basic/docproc
  HOSTCC  scripts/basic/hash
  HOSTCC  scripts/kconfig/conf.o
scripts/kconfig/conf.c: In function ‘conf_sym’:
scripts/kconfig/conf.c:159:6: warning: variable ‘type’ set but not used [-Wunused-but-set-variable]
scripts/kconfig/conf.c: In function ‘conf_choice’:
scripts/kconfig/conf.c:231:6: warning: variable ‘type’ set but not used [-Wunused-but-set-variable]
scripts/kconfig/conf.c:307:9: warning: ignoring return value of ‘fgets’, declared with attribute warn_unused_result [-Wunused-result]
scripts/kconfig/conf.c: In function ‘conf_askvalue’:
scripts/kconfig/conf.c:105:8: warning: ignoring return value of ‘fgets’, declared with attribute warn_unused_result [-Wunused-result]
  HOSTCC  scripts/kconfig/kxgettext.o
  SHIPPED scripts/kconfig/zconf.tab.c
  SHIPPED scripts/kconfig/lex.zconf.c
  SHIPPED scripts/kconfig/zconf.hash.c
  HOSTCC  scripts/kconfig/zconf.tab.o
  HOSTLD  scripts/kconfig/conf
drivers/usb/gadget/Kconfig:849:warning: defaults for choice values not supported
drivers/usb/gadget/Kconfig:1089:warning: defaults for choice values not supported
arch/arm/configs/beni_rev01_defconfig:552:warning: override: reassigning to symbol IPV6_ROUTER_PREF
#
# configuration written to .config
#
make: ../arm-2011.03/bin/arm-none-eabi-gcc: Command not found
scripts/kconfig/conf -s arch/arm/Kconfig
drivers/usb/gadget/Kconfig:849:warning: defaults for choice values not supported
drivers/usb/gadget/Kconfig:1089:warning: defaults for choice values not supported
make: ../arm-2011.03/bin/arm-none-eabi-gcc: Command not found
  CHK     include/linux/version.h
  UPD     include/linux/version.h
  CHK     include/generated/utsrelease.h
  UPD     include/generated/utsrelease.h
  Generating include/generated/mach-types.h
  CC      kernel/bounds.s
/bin/sh: ../arm-2011.03/bin/arm-none-eabi-gcc: not found
make[1]: *** [kernel/bounds.s] Error 127
make: *** [prepare0] Error 2
alexander@ubuntu:~/android/GT-S5830_kernel/kernel$
Maaybe someone can help me xD
7th May 2012, 09:53 PM |#236  
Senior Member
Flag Berlin
Thanks Meter: 40
 
More
Quote:
Originally Posted by DQiB

...
make: ../arm-2011.03/bin/arm-none-eabi-gcc: Command not found
...
[/CODE]

Maaybe someone can help me xD

Cant see your whole sequence of the code, but try to give the complete path instead of ../arm----
DQiB
7th May 2012, 10:10 PM |#237  
Guest
Thanks Meter: 0
 
More
you mean /home/xxx/................

---------- Post added at 11:10 PM ---------- Previous post was at 11:01 PM ----------

nop still the same error -.-


Code:
alexander@ubuntu:~/android/GT-S5830_kernel/kernel$ ./make_kernel_GT-S5830.sh
drivers/usb/gadget/Kconfig:849:warning: defaults for choice values not supported
drivers/usb/gadget/Kconfig:1089:warning: defaults for choice values not supported
arch/arm/configs/beni_rev01_defconfig:552:warning: override: reassigning to symbol IPV6_ROUTER_PREF
#
# configuration written to .config
#
make: home/alexander/android/GT-S5830_kernel/arm-2011.03/bin/arm-none-eabi-gcc: Command not found
scripts/kconfig/conf -s arch/arm/Kconfig
drivers/usb/gadget/Kconfig:849:warning: defaults for choice values not supported
drivers/usb/gadget/Kconfig:1089:warning: defaults for choice values not supported
make: home/alexander/android/GT-S5830_kernel/arm-2011.03/bin/arm-none-eabi-gcc: Command not found
  CHK     include/linux/version.h
  CHK     include/generated/utsrelease.h
make[1]: `include/generated/mach-types.h' is up to date.
  CC      kernel/bounds.s
/bin/sh: home/alexander/android/GT-S5830_kernel/arm-2011.03/bin/arm-none-eabi-gcc: not found
make[1]: *** [kernel/bounds.s] Error 127
make: *** [prepare0] Error 2
alexander@ubuntu:~/android/GT-S5830_kernel/kernel$
lol i think this is the error but, yes i cant do anything
make: home/alexander/android/GT-S5830_kernel/arm-2011.03/bin/arm-none-eabi-gcc: Command not found
but it is there, arm-none-eabi-gcc is in it
8th May 2012, 02:51 AM |#238  
pratyush.creed's Avatar
Senior Member
Flag Gaya,Bihar
Thanks Meter: 4,011
 
More
After gcc at end put '-' so ut will be lyk gcc- ...
The Following User Says Thank You to pratyush.creed For This Useful Post: [ View ]
DQiB
8th May 2012, 05:36 AM |#239  
Guest
Thanks Meter: 0
 
More
trying it if im back from school ;)
DQiB
8th May 2012, 02:31 PM |#240  
Guest
Thanks Meter: 0
 
More
also not working -.-
Post Reply Subscribe to Thread
Previous Thread Next Thread
Thread Tools Search this Thread
Search this Thread:

Advanced Search
Display Modes