Welcome to XDA

Search to go directly to your device's forum

Register an account

Unlock full posting privileges

Ask a question

No registration required
Post Reply

[JB:CM10] ParanoidAndroid 2.10 [CAMERA AND CAMCORDER WORKING]

OP dhk.-

21st September 2012, 03:27 PM   |  #571  
iiandskater's Avatar
Senior Member
Flag Jogjakarta Hardcore
Thanks Meter: 2,851
 
505 posts
Join Date:Joined: Jan 2012
Donate to Me
More
Quote:
Originally Posted by rullean

awwwww... no fair!!!!

other devices can use coconut's rom then patch it with dev files from my JellyVanilla thread (see my signature for link)..

note: for build.prop leave it un-replaced,
then edit it to match ur device properties..
The Following 2 Users Say Thank You to iiandskater For This Useful Post: [ View ]
22nd September 2012, 04:19 AM   |  #572  
Senior Member
Flag Hong Kong
Thanks Meter: 183
 
334 posts
Join Date:Joined: Mar 2012
Question
What changes are there in Paranoid 2.10? The internal changelog is missing. And I want to know what FXP version do Paranoid 2.10 based on.
22nd September 2012, 01:25 PM   |  #573  
Senior Member
Thanks Meter: 8
 
121 posts
Join Date:Joined: Aug 2010
Quote:
Originally Posted by iiandskater

other devices can use coconut's rom then patch it with dev files from my JellyVanilla thread (see my signature for link)..

note: for build.prop leave it un-replaced,
then edit it to match ur device properties..

hmmm.. i am not really a developer so I am afraid of bricking my phone if I do something like this... so I will just wait if dhk loads an update for active...

grrr.. why are there so few people using active???
22nd September 2012, 05:13 PM   |  #574  
gandhar's Avatar
Senior Member
Flag Goa
Thanks Meter: 679
 
1,029 posts
Join Date:Joined: Jan 2012
More
hey dhk.-
i think the build system is broken, its giving me this error

HTML Code:
In file included from system/core/libpixelflinger/codeflinger/CodeCache.h:25:0,
                 from system/core/libpixelflinger/scanline.cpp:32:
system/core/include/cutils/mspace.h:65:27: error: 'mspace' was not declared in this scope
In file included from system/core/libpixelflinger/codeflinger/CodeCache.h:25:0,
                 from system/core/libpixelflinger/pixelflinger.cpp:36:
system/core/include/cutils/mspace.h:65:27: error: 'mspace' was not declared in this scope
system/core/include/cutils/mspace.h:65:35: error: expected primary-expression before 'const'
system/core/include/cutils/mspace.h:65:46: error: expression list treated as compound expression in initializer [-fpermissive]
system/core/include/cutils/mspace.h:65:35: error: expected primary-expression before 'const'
system/core/include/cutils/mspace.h:65:46: error: expression list treated as compound expression in initializer [-fpermissive]
system/core/include/cutils/mspace.h:73:1: error: 'mspace' does not name a type
system/core/include/cutils/mspace.h:80:1: error: 'mspace' does not name a type
system/core/include/cutils/mspace.h:86:1: error: 'mspace' does not name a type
system/core/include/cutils/mspace.h:89:34: error: 'mspace' was not declared in this scope
system/core/include/cutils/mspace.h:73:1: error: 'mspace' does not name a type
system/core/include/cutils/mspace.h:80:1: error: 'mspace' does not name a type
system/core/include/cutils/mspace.h:86:1: error: 'mspace' does not name a type
system/core/include/cutils/mspace.h:94:31: error: 'mspace' was not declared in this scope
system/core/include/cutils/mspace.h:89:34: error: 'mspace' was not declared in this scopesystem/core/include/cutils/mspace.h:106:23: error: variable or field 'mspace_walk_heap' declared void

system/core/include/cutils/mspace.h:106:23: error: 'mspace' was not declared in this scope
system/core/include/cutils/mspace.h:107:11: error: 'handler' was not declared in this scope
system/core/include/cutils/mspace.h:94:31: error: 'mspace' was not declared in this scopesystem/core/include/cutils/mspace.h:107:20: error: expected primary-expression before 'const'

system/core/include/cutils/mspace.h:107:49: error: expected primary-expression before 'chunklen'
system/core/include/cutils/mspace.h:108:9: error: expected primary-expression before 'const'system/core/include/cutils/mspace.h:106:23: error: variable or field 'mspace_walk_heap' declared void

system/core/include/cutils/mspace.h:108:37: error: expected primary-expression before 'userlen'
system/core/include/cutils/mspace.h:106:23: error: 'mspace' was not declared in this scopesystem/core/include/cutils/mspace.h:108:46: error: expected primary-expression before 'void'

system/core/include/cutils/mspace.h:108:58: error: expected primary-expression before 'void'system/core/include/cutils/mspace.h:107:11: error: 'handler' was not declared in this scope

system/core/include/cutils/mspace.h:107:20: error: expected primary-expression before 'const'system/core/include/cutils/mspace.h:121:29: error: variable or field 'mspace_walk_free_pages' declared void

system/core/include/cutils/mspace.h:121:29: error: 'mspace' was not declared in this scopesystem/core/include/cutils/mspace.h:107:49: error: expected primary-expression before 'chunklen'

system/core/include/cutils/mspace.h:108:9: error: expected primary-expression before 'const'system/core/include/cutils/mspace.h:122:11: error: 'handler' was not declared in this scope

system/core/include/cutils/mspace.h:108:37: error: expected primary-expression before 'userlen'system/core/include/cutils/mspace.h:122:20: error: expected primary-expression before 'void'

system/core/include/cutils/mspace.h:108:46: error: expected primary-expression before 'void'system/core/include/cutils/mspace.h:122:33: error: expected primary-expression before 'void'

system/core/include/cutils/mspace.h:122:44: error: expected primary-expression before 'void'system/core/include/cutils/mspace.h:108:58: error: expected primary-expression before 'void'

system/core/include/cutils/mspace.h:122:56: error: expected primary-expression before 'void'
system/core/include/cutils/mspace.h:121:29: error: variable or field 'mspace_walk_free_pages' declared void
system/core/include/cutils/mspace.h:121:29: error: 'mspace' was not declared in this scope
system/core/include/cutils/mspace.h:122:11: error: 'handler' was not declared in this scope
system/core/include/cutils/mspace.h:122:20: error: expected primary-expression before 'void'
system/core/include/cutils/mspace.h:122:33: error: expected primary-expression before 'void'
system/core/include/cutils/mspace.h:122:44: error: expected primary-expression before 'void'
system/core/include/cutils/mspace.h:122:56: error: expected primary-expression before 'void'
In file included from system/core/libpixelflinger/scanline.cpp:32:0:
system/core/libpixelflinger/codeflinger/CodeCache.h:71:13: error: 'mspace' does not name a type
In file included from system/core/libpixelflinger/pixelflinger.cpp:36:0:
system/core/libpixelflinger/codeflinger/CodeCache.h:71:13: error: 'mspace' does not name a type
make: *** [out/target/product/coconut/obj/STATIC_LIBRARIES/libpixelflinger_static_intermediates/pixelflinger.o] Error 1
make: *** Waiting for unfinished jobs....
make: *** [out/target/product/coconut/obj/STATIC_LIBRARIES/libpixelflinger_static_intermediates/scanline.o] Error 1

the html thing is just for reducing the size
22nd September 2012, 06:31 PM   |  #575  
nico9's Avatar
Member
Flag owl
Thanks Meter: 2
 
30 posts
Join Date:Joined: Aug 2012
More
I would like to be your device tester, i ve use wt19i device,
bug : - backlight key off
- accelerometer lag
- front camera&camera quality
(i know , & i was mention sony via twitter yesterday to release jb lib, & they replied that they will decide it latter )
- i will report latter

overall this rom is best for me. smoth, simple, elegant, and batt drain +/- 10% every 2h (edge)
i ve played game asphalt7, running well but accelerometer is broken.

please continue your development..
i've hopeless to cm7,cm9.1, cm 10 ..

sorry for my bad english
22nd September 2012, 06:43 PM   |  #576  
Senior Member
Thanks Meter: 45
 
360 posts
Join Date:Joined: Dec 2011
More
Quote:
Originally Posted by nico9

I would like to be your device tester, i ve use wt19i device,
bug : - backlight key off
- accelerometer lag
- front camera&camera quality
(i know , & i was mention sony via twitter yesterday to release jb lib, & they replied that they will decide it latter )
- i will report latter

overall this rom is best for me. smoth, simple, elegant, and batt drain +/- 10% every 2h (edge)
i ve played game asphalt7, running well but accelerometer is broken.

please continue your development..
i've hopeless to cm7,cm9.1, cm 10 ..

sorry for my bad english

lol its not hopeless haha..BTW no one answered my question which was how to make the sound loud on wt19i on CM9 ?
22nd September 2012, 06:45 PM   |  #577  
dhk.-'s Avatar
OP Senior Member
Flag Rancagua
Thanks Meter: 974
 
872 posts
Join Date:Joined: Aug 2011
Donate to Me
More
Quote:
Originally Posted by gandhar

hey dhk.-
i think the build system is broken, its giving me this error

HTML Code:
In file included from system/core/libpixelflinger/codeflinger/CodeCache.h:25:0,
                 from system/core/libpixelflinger/scanline.cpp:32:
system/core/include/cutils/mspace.h:65:27: error: 'mspace' was not declared in this scope
In file included from system/core/libpixelflinger/codeflinger/CodeCache.h:25:0,
                 from system/core/libpixelflinger/pixelflinger.cpp:36:
system/core/include/cutils/mspace.h:65:27: error: 'mspace' was not declared in this scope
system/core/include/cutils/mspace.h:65:35: error: expected primary-expression before 'const'
system/core/include/cutils/mspace.h:65:46: error: expression list treated as compound expression in initializer [-fpermissive]
system/core/include/cutils/mspace.h:65:35: error: expected primary-expression before 'const'
system/core/include/cutils/mspace.h:65:46: error: expression list treated as compound expression in initializer [-fpermissive]
system/core/include/cutils/mspace.h:73:1: error: 'mspace' does not name a type
system/core/include/cutils/mspace.h:80:1: error: 'mspace' does not name a type
system/core/include/cutils/mspace.h:86:1: error: 'mspace' does not name a type
system/core/include/cutils/mspace.h:89:34: error: 'mspace' was not declared in this scope
system/core/include/cutils/mspace.h:73:1: error: 'mspace' does not name a type
system/core/include/cutils/mspace.h:80:1: error: 'mspace' does not name a type
system/core/include/cutils/mspace.h:86:1: error: 'mspace' does not name a type
system/core/include/cutils/mspace.h:94:31: error: 'mspace' was not declared in this scope
system/core/include/cutils/mspace.h:89:34: error: 'mspace' was not declared in this scopesystem/core/include/cutils/mspace.h:106:23: error: variable or field 'mspace_walk_heap' declared void

system/core/include/cutils/mspace.h:106:23: error: 'mspace' was not declared in this scope
system/core/include/cutils/mspace.h:107:11: error: 'handler' was not declared in this scope
system/core/include/cutils/mspace.h:94:31: error: 'mspace' was not declared in this scopesystem/core/include/cutils/mspace.h:107:20: error: expected primary-expression before 'const'

system/core/include/cutils/mspace.h:107:49: error: expected primary-expression before 'chunklen'
system/core/include/cutils/mspace.h:108:9: error: expected primary-expression before 'const'system/core/include/cutils/mspace.h:106:23: error: variable or field 'mspace_walk_heap' declared void

system/core/include/cutils/mspace.h:108:37: error: expected primary-expression before 'userlen'
system/core/include/cutils/mspace.h:106:23: error: 'mspace' was not declared in this scopesystem/core/include/cutils/mspace.h:108:46: error: expected primary-expression before 'void'

system/core/include/cutils/mspace.h:108:58: error: expected primary-expression before 'void'system/core/include/cutils/mspace.h:107:11: error: 'handler' was not declared in this scope

system/core/include/cutils/mspace.h:107:20: error: expected primary-expression before 'const'system/core/include/cutils/mspace.h:121:29: error: variable or field 'mspace_walk_free_pages' declared void

system/core/include/cutils/mspace.h:121:29: error: 'mspace' was not declared in this scopesystem/core/include/cutils/mspace.h:107:49: error: expected primary-expression before 'chunklen'

system/core/include/cutils/mspace.h:108:9: error: expected primary-expression before 'const'system/core/include/cutils/mspace.h:122:11: error: 'handler' was not declared in this scope

system/core/include/cutils/mspace.h:108:37: error: expected primary-expression before 'userlen'system/core/include/cutils/mspace.h:122:20: error: expected primary-expression before 'void'

system/core/include/cutils/mspace.h:108:46: error: expected primary-expression before 'void'system/core/include/cutils/mspace.h:122:33: error: expected primary-expression before 'void'

system/core/include/cutils/mspace.h:122:44: error: expected primary-expression before 'void'system/core/include/cutils/mspace.h:108:58: error: expected primary-expression before 'void'

system/core/include/cutils/mspace.h:122:56: error: expected primary-expression before 'void'
system/core/include/cutils/mspace.h:121:29: error: variable or field 'mspace_walk_free_pages' declared void
system/core/include/cutils/mspace.h:121:29: error: 'mspace' was not declared in this scope
system/core/include/cutils/mspace.h:122:11: error: 'handler' was not declared in this scope
system/core/include/cutils/mspace.h:122:20: error: expected primary-expression before 'void'
system/core/include/cutils/mspace.h:122:33: error: expected primary-expression before 'void'
system/core/include/cutils/mspace.h:122:44: error: expected primary-expression before 'void'
system/core/include/cutils/mspace.h:122:56: error: expected primary-expression before 'void'
In file included from system/core/libpixelflinger/scanline.cpp:32:0:
system/core/libpixelflinger/codeflinger/CodeCache.h:71:13: error: 'mspace' does not name a type
In file included from system/core/libpixelflinger/pixelflinger.cpp:36:0:
system/core/libpixelflinger/codeflinger/CodeCache.h:71:13: error: 'mspace' does not name a type
make: *** [out/target/product/coconut/obj/STATIC_LIBRARIES/libpixelflinger_static_intermediates/pixelflinger.o] Error 1
make: *** Waiting for unfinished jobs....
make: *** [out/target/product/coconut/obj/STATIC_LIBRARIES/libpixelflinger_static_intermediates/scanline.o] Error 1

the html thing is just for reducing the size

I have the same errors and I don't know why...

I will upload the latest update today.. my phone's screen its broken and I have no money yet to buy a new one.... I have ROMs ready for mango, coconut, anzu, hallon and smultron... thanks make to the errors building I can't provide a new version for satsuma... so sorry...

Enviado desde mi u8800pro usando Tapatalk 2
The Following 2 Users Say Thank You to dhk.- For This Useful Post: [ View ]
22nd September 2012, 06:54 PM   |  #578  
gandhar's Avatar
Senior Member
Flag Goa
Thanks Meter: 679
 
1,029 posts
Join Date:Joined: Jan 2012
More
Quote:
Originally Posted by dhk.-

I have the same errors and I don't know why...

I will upload the latest update today.. my phone's screen its broken and I have no money yet to buy a new one.... I have ROMs ready for mango, coconut, anzu, hallon and smultron... thanks make to the errors building I can't provide a new version for satsuma... so sorry...

Enviado desde mi u8800pro usando Tapatalk 2

i use a coconut so that's fine, satsuma guys could replace some files and use i guess.

hope you get the phone repaired soon

i'll try to look into the error if i have the time
22nd September 2012, 08:36 PM   |  #579  
Steph310's Avatar
Senior Member
Flag Toulouse, France
Thanks Meter: 1,171
 
1,262 posts
Join Date:Joined: Jul 2012
More
Thanks for this very good rom!!!
However, I have some wishes:
- torch in notification bar not working
- I like time/date centered on lockscreen
- wifi seems to be unstable compared ICS
- ALS not working
- battery drain seems to be excessive compared ICS
23rd September 2012, 01:32 AM   |  #580  
Senior Member
Thanks Meter: 542
 
842 posts
Join Date:Joined: Jun 2012
I made the mods for satsuma using dev files from jellyvanilla (and editing the build.prop correctly).
I will try the rom tonight if i have time.
If iiandskater and dhk.- allow me (if everything works) i can upload 2.11 by the morning
Last edited by Rudjgaard; 23rd September 2012 at 05:02 AM.

Post Reply Subscribe to Thread
Previous Thread Next Thread
Thread Tools Search this Thread
Search this Thread:

Advanced Search
Display Modes