FORUMS

New Xposed for Lollipop 5.0 Update Fixes Major Bugs

Senior Recognized Developer rovo89 has patched Xposed for Lollipop 5.0 to … more

Download Sony’s new AOSP-like concept for Xperia Z3

Over in our forums, Recognized Contributor Jozinek has posted a very … more

OnePlus 2 vs Moto X Style: Which is The Better Flagship?

Two big industry names have announced their newest flagship phones within the … more

Making Your Own Xposed Modules Is Easier Than You Think

Close to the heart of XDA is the Xposed Framework by Rovo89. Most of … more

APK Manager Ver 5.0 - Makes Modifying Ur Apk A Breeze (Windows/Linux)

1,013 posts
Thanks Meter: 972
 
Thread Closed Subscribe to Thread Email Thread
11th September 2011, 05:12 PM |#61  
Account currently disabled
Flag Wisconsin
Thanks Meter: 744
 
More
very nice job. one question/bug

when batch optimizing, with some apks it asks if it is a directory or file. i select directory and it works fine. i dont get why it asks tho?
 
 
11th September 2011, 06:31 PM |#62  
dsmitty166's Avatar
Senior Member
Flag Sioux Center, Iowa
Thanks Meter: 4,919
 
Donate to Me
More
Trying to sign an APK...

Keep getting this error no matter what I do...

Always looks for an additional unsigned....

Code:
-------------------------------------------------------------------------- 
|Sun 09/11/2011 -- 12:28:58.44| 
-------------------------------------------------------------------------- 
java version "1.7.0"
Java(TM) SE Runtime Environment (build 1.7.0-b147)
Java HotSpot(TM) 64-Bit Server VM (build 21.0-b17, mixed mode)
java.io.FileNotFoundException: ..\place-apk-here-for-modding\unsignedcom.swype.android.inputmethod-1.apk (The system cannot find the file specified)
	at java.util.zip.ZipFile.open(Native Method)
	at java.util.zip.ZipFile.<init>(Unknown Source)
	at java.util.zip.ZipFile.<init>(Unknown Source)
	at java.util.jar.JarFile.<init>(Unknown Source)
	at java.util.jar.JarFile.<init>(Unknown Source)
	at com.android.signapk.SignApk.main(SignApk.java:437)
Could Not Find C:\Users\David\Desktop\APK Manager 5.0.1\place-apk-here-for-modding\../place-apk-here-for-modding/unsignedcom.swype.android.inputmethod-1.apk
java.io.FileNotFoundException: ..\place-apk-here-for-modding\unsignedunsignedcom.swype.android.inputmethod-1.apk (The system cannot find the file specified)
	at java.util.zip.ZipFile.open(Native Method)
	at java.util.zip.ZipFile.<init>(Unknown Source)
	at java.util.zip.ZipFile.<init>(Unknown Source)
	at java.util.jar.JarFile.<init>(Unknown Source)
	at java.util.jar.JarFile.<init>(Unknown Source)
	at com.android.signapk.SignApk.main(SignApk.java:437)
Could Not Find C:\Users\David\Desktop\APK Manager 5.0.1\place-apk-here-for-modding\../place-apk-here-for-modding/unsignedunsignedcom.swype.android.inputmethod-1.apk
11th September 2011, 08:24 PM |#63  
robm1911's Avatar
Recognized Contributor / Themer
Flag Weatherford Tx.
Thanks Meter: 2,141
 
Donate to Me
More
Wow thank you for this I have allways had problems getting APK Manager ro recgonize ADB. Now that you have made this self contianed all my problems are gone (except trying to figure out what I'm going to use it for next)

Edit: so trying to figure out what to do with this I tried to decompile the settings.apk using option 10 then it asks for the dependee apk tried dropping in the framework-res apk then I'm told thats not the dependee apk and to try again. So on a samsung captivate what is the dependee apk???
Last edited by robm1911; 12th September 2011 at 01:32 AM.
12th September 2011, 02:18 AM |#64  
adude247's Avatar
Senior Member
Thanks Meter: 616
 
More
I have the same problem sometimes trying to decompile apps from the market, some will and some wont dont underdtand why....

Sent from my SCH-I500 using XDA Premium App
12th September 2011, 07:26 AM |#65  
waterpolo's Avatar
Senior Member
Flag Naarden (NL)
Thanks Meter: 135
 
More
Quote:
Originally Posted by adude247

I have the same problem sometimes trying to decompile apps from the market, some will and some wont dont underdtand why....

Sent from my SCH-I500 using XDA Premium App

+1

i.e. new market, google maps
12th September 2011, 02:51 PM |#66  
gcamp0730's Avatar
Senior Member
Flag Texas
Thanks Meter: 37
 
Donate to Me
More
Quote:
Originally Posted by dsmitty166

Trying to sign an APK...

Keep getting this error no matter what I do...

Always looks for an additional unsigned....

Code:
-------------------------------------------------------------------------- 
|Sun 09/11/2011 -- 12:28:58.44| 
-------------------------------------------------------------------------- 
java version "1.7.0"
Java(TM) SE Runtime Environment (build 1.7.0-b147)
Java HotSpot(TM) 64-Bit Server VM (build 21.0-b17, mixed mode)
java.io.FileNotFoundException: ..\place-apk-here-for-modding\unsignedcom.swype.android.inputmethod-1.apk (The system cannot find the file specified)
	at java.util.zip.ZipFile.open(Native Method)
	at java.util.zip.ZipFile.<init>(Unknown Source)
	at java.util.zip.ZipFile.<init>(Unknown Source)
	at java.util.jar.JarFile.<init>(Unknown Source)
	at java.util.jar.JarFile.<init>(Unknown Source)
	at com.android.signapk.SignApk.main(SignApk.java:437)
Could Not Find C:\Users\David\Desktop\APK Manager 5.0.1\place-apk-here-for-modding\../place-apk-here-for-modding/unsignedcom.swype.android.inputmethod-1.apk
java.io.FileNotFoundException: ..\place-apk-here-for-modding\unsignedunsignedcom.swype.android.inputmethod-1.apk (The system cannot find the file specified)
	at java.util.zip.ZipFile.open(Native Method)
	at java.util.zip.ZipFile.<init>(Unknown Source)
	at java.util.zip.ZipFile.<init>(Unknown Source)
	at java.util.jar.JarFile.<init>(Unknown Source)
	at java.util.jar.JarFile.<init>(Unknown Source)
	at com.android.signapk.SignApk.main(SignApk.java:437)
Could Not Find C:\Users\David\Desktop\APK Manager 5.0.1\place-apk-here-for-modding\../place-apk-here-for-modding/unsignedunsignedcom.swype.android.inputmethod-1.apk

I notice in the OP there is mention of using folder names without spaces. You might try that to see if it makes a difference.


Sent from my SGH-I897 using xda premium
13th September 2011, 04:40 AM |#67  
Jaxwindle's Avatar
Member
Flag Jacksonville, FL
Thanks Meter: 6
 
More
Thank you for the information on special chars and spaces in the path directory. I took them out, and now I have no problems decompiling apks.
13th September 2011, 07:24 AM |#68  
Member
Thanks Meter: 3
 
More
hello , thanks for posting this for us to use , but here is the problem im facing
i downloaded the zip , extracted to my home folder (linux) and chmod the files . then attempted to excute the Script.sh file and here is the outcome:

Code:
The program optipng is missing or is not in your PATH,
please install it or fix your PATH variable
The program 7za is missing or is not in your PATH,
please install it or fix your PATH variable
The program sox is missing or is not in your PATH,
please install it or fix your PATH variable
14th September 2011, 11:50 AM |#69  
Senior Member
Thanks Meter: 242
 
Donate to Me
More
Here is my error. I cannot de-compile or compile with 9, 10, or 11.

Code:
-------------------------------------------------------------------------- 
|Wed 09/14/2011 --  4:03:33.33| 
-------------------------------------------------------------------------- 
java version "1.6.0_26"
Java(TM) SE Runtime Environment (build 1.6.0_26-b03)
Java HotSpot(TM) Client VM (build 20.1-b02, mixed mode, sharing)
I: Framework installed to: C:\Documents and Settings\Michael\apktool\framework\1.apk
I: Baksmaling...
I: Loading resource table...
I: Loaded.
I: Loading resource table from file: C:\Documents and Settings\Michael\apktool\framework\1.apk
I: Loaded.
I: Decoding file-resources...
W: Could not decode attr value, using undecoded value instead: ns=android, name=resizeMode, value=0x00000003
W: Could not decode attr value, using undecoded value instead: ns=android, name=resizeMode, value=0x00000003
I: Decoding values*/* XMLs...
I: Done.
Exception in thread "main" brut.androlib.err.UndefinedResObject: resource spec: 0x01010363
	at brut.androlib.res.data.ResPackage.getResSpec(ResPackage.java:61)
	at brut.androlib.res.data.ResTable.getResSpec(ResTable.java:55)
	at brut.androlib.res.data.ResTable.getResSpec(ResTable.java:51)
	at brut.androlib.res.decoder.ResAttrDecoder.decode(ResAttrDecoder.java:35)
	at brut.androlib.res.decoder.AXmlResourceParser.getAttributeValue(AXmlResourceParser.java:315)
	at org.xmlpull.v1.wrapper.classic.XmlPullParserDelegate.getAttributeValue(XmlPullParserDelegate.java:69)
	at org.xmlpull.v1.wrapper.classic.StaticXmlSerializerWrapper.writeStartTag(StaticXmlSerializerWrapper.java:267)
	at org.xmlpull.v1.wrapper.classic.StaticXmlSerializerWrapper.event(StaticXmlSerializerWrapper.java:211)
	at brut.androlib.res.decoder.XmlPullStreamDecoder.decode(XmlPullStreamDecoder.java:46)
	at brut.androlib.res.decoder.ResStreamDecoderContainer.decode(ResStreamDecoderContainer.java:34)
	at brut.androlib.res.decoder.ResFileDecoder.decode(ResFileDecoder.java:100)
	at brut.androlib.res.decoder.ResFileDecoder.decode(ResFileDecoder.java:86)
	at brut.androlib.res.AndrolibResources.decode(AndrolibResources.java:132)
	at brut.androlib.Androlib.decodeResourcesFull(Androlib.java:93)
	at brut.androlib.ApkDecoder.decode(ApkDecoder.java:98)
	at brut.apktool.Main.cmdDecode(Main.java:120)
	at brut.apktool.Main.main(Main.java:57)
Last edited by reekotubbs; 14th September 2011 at 12:05 PM.
17th September 2011, 06:36 AM |#70  
zohaib0001's Avatar
Senior Member
Flag Lahore
Thanks Meter: 3,426
 
More
Question arc camera apk problem in decompile and compile
i am trying to recompile xperia ARC camera apk from rom 4.0.A.2.368

but its always give me an error and recompile is unsuccessful

i put apk in the folder 'place apk here for modding'
then run the bat script
then select option 22 then i select my project apk
then i select 9 which is decompile the apk
then if you try to recompile it again its always gives an error that could not compile it

any one can help me
17th September 2011, 11:35 AM |#71  
Perka's Avatar
Senior Member
Thanks Meter: 3,137
 
More
Hi I decompiled framework-res from GB JVS Samsung Sgs, did not mod or change anything and get this error, any help?

SDK is in path, and I have Java.

Code:
ic.xml:2557: error: Public symbol string/sms_control_message declared here is no
t defined.
c:\Windows\Apk_Manager_5.0.1\other\..\projects\framework-res.apk\res\values\publ
ic.xml:2559: error: Public symbol string/sms_control_no declared here is not def
ined.
c:\Windows\Apk_Manager_5.0.1\other\..\projects\framework-res.apk\res\values\publ
ic.xml:2556: error: Public symbol string/sms_control_title declared here is not
defined.
c:\Windows\Apk_Manager_5.0.1\other\..\projects\framework-res.apk\res\values\publ
ic.xml:2558: error: Public symbol string/sms_control_yes declared here is not de
fined.
c:\Windows\Apk_Manager_5.0.1\other\..\projects\framework-res.apk\res\values\publ
ic.xml:2528: error: Public symbol string/smv_application declared here is not de
fined.
c:\Windows\Apk_Manager_5.0.1\other\..\projects\framework-res.apk\res\values\publ
ic.xml:2529: error: Public symbol string/smv_process declared here is not define
d.
c:\Windows\Apk_Manager_5.0.1\other\..\projects\framework-res.apk\res\values\publ
ic.xml:2687: error: Public symbol string/submit declared here is not defined.
c:\Windows\Apk_Manager_5.0.1\other\..\projects\framework-res.apk\res\values\publ
ic.xml:2767: error: Public symbol string/sum_default_caller_id declared here is
not defined.
c:\Windows\Apk_Manager_5.0.1\other\..\projects\framework-res.apk\res\values\publ
ic.xml:2765: error: Public symbol string/sum_hide_caller_id declared here is not
 defined.
c:\Windows\Apk_Manager_5.0.1\other\..\projects\framework-res.apk\res\values\publ
ic.xml:2766: error: Public symbol string/sum_show_caller_id declared here is not
 defined.
c:\Windows\Apk_Manager_5.0.1\other\..\projects\framework-res.apk\res\values\publ
ic.xml:2650: error: Public symbol string/sync_binding_label declared here is not
 defined.
c:\Windows\Apk_Manager_5.0.1\other\..\projects\framework-res.apk\res\values\publ
ic.xml:2692: error: Public symbol string/tethered_notification_message declared
here is not defined.
c:\Windows\Apk_Manager_5.0.1\other\..\projects\framework-res.apk\res\values\publ
ic.xml:2691: error: Public symbol string/tethered_notification_title declared he
re is not defined.
c:\Windows\Apk_Manager_5.0.1\other\..\projects\framework-res.apk\res\values\publ
ic.xml:2464: error: Public symbol string/text_copied declared here is not define
d.
c:\Windows\Apk_Manager_5.0.1\other\..\projects\framework-res.apk\res\values\publ
ic.xml:2694: error: Public symbol string/throttle_warning_notification_message d
eclared here is not defined.
c:\Windows\Apk_Manager_5.0.1\other\..\projects\framework-res.apk\res\values\publ
ic.xml:2693: error: Public symbol string/throttle_warning_notification_title dec
lared here is not defined.
c:\Windows\Apk_Manager_5.0.1\other\..\projects\framework-res.apk\res\values\publ
ic.xml:2696: error: Public symbol string/throttled_notification_message declared
 here is not defined.
c:\Windows\Apk_Manager_5.0.1\other\..\projects\framework-res.apk\res\values\publ
ic.xml:2695: error: Public symbol string/throttled_notification_title declared h
ere is not defined.
c:\Windows\Apk_Manager_5.0.1\other\..\projects\framework-res.apk\res\values\publ
ic.xml:1732: error: Public symbol string/time1_time2 declared here is not define
d.
c:\Windows\Apk_Manager_5.0.1\other\..\projects\framework-res.apk\res\values\publ
ic.xml:1724: error: Public symbol string/time_date declared here is not defined.

c:\Windows\Apk_Manager_5.0.1\other\..\projects\framework-res.apk\res\values\publ
ic.xml:1721: error: Public symbol string/time_of_day declared here is not define
d.
c:\Windows\Apk_Manager_5.0.1\other\..\projects\framework-res.apk\res\values\publ
ic.xml:1747: error: Public symbol string/time_wday declared here is not defined.

c:\Windows\Apk_Manager_5.0.1\other\..\projects\framework-res.apk\res\values\publ
ic.xml:1745: error: Public symbol string/time_wday_date declared here is not def
ined.
c:\Windows\Apk_Manager_5.0.1\other\..\projects\framework-res.apk\res\values\publ
ic.xml:2728: error: Public symbol string/toast_bluetooth_keyboard_connected decl
ared here is not defined.
c:\Windows\Apk_Manager_5.0.1\other\..\projects\framework-res.apk\res\values\publ
ic.xml:2729: error: Public symbol string/toast_keyboard_dock_connected declared
here is not defined.
c:\Windows\Apk_Manager_5.0.1\other\..\projects\framework-res.apk\res\values\publ
ic.xml:2629: error: Public symbol string/tutorial_double_tap_to_zoom_message_sho
rt declared here is not defined.
c:\Windows\Apk_Manager_5.0.1\other\..\projects\framework-res.apk\res\values\publ
ic.xml:2587: error: Public symbol string/tv_out_suspend declared here is not def
ined.
c:\Windows\Apk_Manager_5.0.1\other\..\projects\framework-res.apk\res\values\publ
ic.xml:2499: error: Public symbol string/undo declared here is not defined.
c:\Windows\Apk_Manager_5.0.1\other\..\projects\framework-res.apk\res\values\publ
ic.xml:2685: error: Public symbol string/upload_file declared here is not define
d.
c:\Windows\Apk_Manager_5.0.1\other\..\projects\framework-res.apk\res\values\publ
ic.xml:2566: error: Public symbol string/usb_storage_activity_title declared her
e is not defined.
c:\Windows\Apk_Manager_5.0.1\other\..\projects\framework-res.apk\res\values\publ
ic.xml:2570: error: Public symbol string/usb_storage_button_mount declared here
is not defined.
c:\Windows\Apk_Manager_5.0.1\other\..\projects\framework-res.apk\res\values\publ
ic.xml:2571: error: Public symbol string/usb_storage_error_message declared here
 is not defined.
c:\Windows\Apk_Manager_5.0.1\other\..\projects\framework-res.apk\res\values\publ
ic.xml:2572: error: Public symbol string/usb_storage_error_message_sd declared h
ere is not defined.
c:\Windows\Apk_Manager_5.0.1\other\..\projects\framework-res.apk\res\values\publ
ic.xml:2568: error: Public symbol string/usb_storage_message declared here is no
t defined.
c:\Windows\Apk_Manager_5.0.1\other\..\projects\framework-res.apk\res\values\publ
ic.xml:2569: error: Public symbol string/usb_storage_message_sd declared here is
 not defined.
c:\Windows\Apk_Manager_5.0.1\other\..\projects\framework-res.apk\res\values\publ
ic.xml:2574: error: Public symbol string/usb_storage_notification_message declar
ed here is not defined.
c:\Windows\Apk_Manager_5.0.1\other\..\projects\framework-res.apk\res\values\publ
ic.xml:2573: error: Public symbol string/usb_storage_notification_title declared
 here is not defined.
c:\Windows\Apk_Manager_5.0.1\other\..\projects\framework-res.apk\res\values\publ
ic.xml:2580: error: Public symbol string/usb_storage_stop_button_mount declared
here is not defined.
c:\Windows\Apk_Manager_5.0.1\other\..\projects\framework-res.apk\res\values\publ
ic.xml:2581: error: Public symbol string/usb_storage_stop_error_message declared
 here is not defined.
c:\Windows\Apk_Manager_5.0.1\other\..\projects\framework-res.apk\res\values\publ
ic.xml:2578: error: Public symbol string/usb_storage_stop_message declared here
is not defined.
c:\Windows\Apk_Manager_5.0.1\other\..\projects\framework-res.apk\res\values\publ
ic.xml:2579: error: Public symbol string/usb_storage_stop_message_sd declared he
re is not defined.
c:\Windows\Apk_Manager_5.0.1\other\..\projects\framework-res.apk\res\values\publ
ic.xml:2576: error: Public symbol string/usb_storage_stop_notification_message d
eclared here is not defined.
c:\Windows\Apk_Manager_5.0.1\other\..\projects\framework-res.apk\res\values\publ
ic.xml:2575: error: Public symbol string/usb_storage_stop_notification_title dec
lared here is not defined.
c:\Windows\Apk_Manager_5.0.1\other\..\projects\framework-res.apk\res\values\publ
ic.xml:2577: error: Public symbol string/usb_storage_stop_title declared here is
 not defined.
c:\Windows\Apk_Manager_5.0.1\other\..\projects\framework-res.apk\res\values\publ
ic.xml:2567: error: Public symbol string/usb_storage_title declared here is not
defined.
c:\Windows\Apk_Manager_5.0.1\other\..\projects\framework-res.apk\res\values\publ
ic.xml:2545: error: Public symbol string/volume_alarm declared here is not defin
ed.
c:\Windows\Apk_Manager_5.0.1\other\..\projects\framework-res.apk\res\values\publ
ic.xml:2544: error: Public symbol string/volume_bluetooth_call declared here is
not defined.
c:\Windows\Apk_Manager_5.0.1\other\..\projects\framework-res.apk\res\values\publ
ic.xml:2543: error: Public symbol string/volume_call declared here is not define
d.
c:\Windows\Apk_Manager_5.0.1\other\..\projects\framework-res.apk\res\values\publ
ic.xml:2540: error: Public symbol string/volume_music declared here is not defin
ed.
c:\Windows\Apk_Manager_5.0.1\other\..\projects\framework-res.apk\res\values\publ
ic.xml:2541: error: Public symbol string/volume_music_hint_playing_through_bluet
ooth declared here is not defined.
c:\Windows\Apk_Manager_5.0.1\other\..\projects\framework-res.apk\res\values\publ
ic.xml:2542: error: Public symbol string/volume_music_hint_silent_ringtone_selec
ted declared here is not defined.
c:\Windows\Apk_Manager_5.0.1\other\..\projects\framework-res.apk\res\values\publ
ic.xml:2546: error: Public symbol string/volume_notification declared here is no
t defined.
c:\Windows\Apk_Manager_5.0.1\other\..\projects\framework-res.apk\res\values\publ
ic.xml:2539: error: Public symbol string/volume_ringtone declared here is not de
fined.
c:\Windows\Apk_Manager_5.0.1\other\..\projects\framework-res.apk\res\values\publ
ic.xml:2547: error: Public symbol string/volume_unknown declared here is not def
ined.
c:\Windows\Apk_Manager_5.0.1\other\..\projects\framework-res.apk\res\values\publ
ic.xml:2524: error: Public symbol string/wait declared here is not defined.
c:\Windows\Apk_Manager_5.0.1\other\..\projects\framework-res.apk\res\values\publ
ic.xml:2652: error: Public symbol string/wallpaper_binding_label declared here i
s not defined.
c:\Windows\Apk_Manager_5.0.1\other\..\projects\framework-res.apk\res\values\publ
ic.xml:1742: error: Public symbol string/wday1_date1_time1_wday2_date2_time2 dec
lared here is not defined.
c:\Windows\Apk_Manager_5.0.1\other\..\projects\framework-res.apk\res\values\publ
ic.xml:1743: error: Public symbol string/wday1_date1_wday2_date2 declared here i
s not defined.
c:\Windows\Apk_Manager_5.0.1\other\..\projects\framework-res.apk\res\values\publ
ic.xml:1746: error: Public symbol string/wday_date declared here is not defined.

c:\Windows\Apk_Manager_5.0.1\other\..\projects\framework-res.apk\res\values\publ
ic.xml:2445: error: Public symbol string/web_user_agent declared here is not def
ined.
c:\Windows\Apk_Manager_5.0.1\other\..\projects\framework-res.apk\res\values\publ
ic.xml:2745: error: Public symbol string/webex_url declared here is not defined.

c:\Windows\Apk_Manager_5.0.1\other\..\projects\framework-res.apk\res\values\publ
ic.xml:2485: error: Public symbol string/week declared here is not defined.
c:\Windows\Apk_Manager_5.0.1\other\..\projects\framework-res.apk\res\values\publ
ic.xml:2486: error: Public symbol string/weeks declared here is not defined.
c:\Windows\Apk_Manager_5.0.1\other\..\projects\framework-res.apk\res\values\publ
ic.xml:2508: error: Public symbol string/whichApplication declared here is not d
efined.
c:\Windows\Apk_Manager_5.0.1\other\..\projects\framework-res.apk\res\values\publ
ic.xml:2553: error: Public symbol string/wifi_tether_configure_ssid_default decl
ared here is not defined.
c:\Windows\Apk_Manager_5.0.1\other\..\projects\framework-res.apk\res\values\publ
ic.xml:2742: error: Public symbol string/wipe_data_security_policy declared here
 is not defined.
c:\Windows\Apk_Manager_5.0.1\other\..\projects\framework-res.apk\res\values\publ
ic.xml:2487: error: Public symbol string/year declared here is not defined.
c:\Windows\Apk_Manager_5.0.1\other\..\projects\framework-res.apk\res\values\publ
ic.xml:2488: error: Public symbol string/years declared here is not defined.
c:\Windows\Apk_Manager_5.0.1\other\..\projects\framework-res.apk\res\values\publ
ic.xml:2675: error: Public symbol string/zzz_battery_title_string declared here
is not defined.
c:\Windows\Apk_Manager_5.0.1\other\..\projects\framework-res.apk\res\values\publ
ic.xml:2676: error: Public symbol string/zzz_discharge_battery_string declared h
ere is not defined.
c:\Windows\Apk_Manager_5.0.1\other\..\projects\framework-res.apk\res\values\publ
ic.xml:2684: error: Public symbol string/zzz_dual_clock_city_local declared here
 is not defined.
c:\Windows\Apk_Manager_5.0.1\other\..\projects\framework-res.apk\res\values\publ
ic.xml:2683: error: Public symbol string/zzz_dual_clock_city_seoul declared here
 is not defined.
c:\Windows\Apk_Manager_5.0.1\other\..\projects\framework-res.apk\res\values\publ
ic.xml:2679: error: Public symbol string/zzz_empty_battery_string declared here
is not defined.
c:\Windows\Apk_Manager_5.0.1\other\..\projects\framework-res.apk\res\values\publ
ic.xml:2672: error: Public symbol string/zzz_fake_call_activated declared here i
s not defined.
c:\Windows\Apk_Manager_5.0.1\other\..\projects\framework-res.apk\res\values\publ
ic.xml:2677: error: Public symbol string/zzz_fullcharge_battery_string declared
here is not defined.
c:\Windows\Apk_Manager_5.0.1\other\..\projects\framework-res.apk\res\values\publ
ic.xml:2665: error: Public symbol string/zzz_glass_lock_help_text_1 declared her
e is not defined.
c:\Windows\Apk_Manager_5.0.1\other\..\projects\framework-res.apk\res\values\publ
ic.xml:2666: error: Public symbol string/zzz_glass_lock_help_text_2 declared her
e is not defined.
c:\Windows\Apk_Manager_5.0.1\other\..\projects\framework-res.apk\res\values\publ
ic.xml:2715: error: Public symbol string/zzz_global_action_data_mode_off_status
declared here is not defined.
c:\Windows\Apk_Manager_5.0.1\other\..\projects\framework-res.apk\res\values\publ
ic.xml:2714: error: Public symbol string/zzz_global_action_data_mode_on_status d
eclared here is not defined.
c:\Windows\Apk_Manager_5.0.1\other\..\projects\framework-res.apk\res\values\publ
ic.xml:2713: error: Public symbol string/zzz_global_action_toggle_data_mode decl
ared here is not defined.
c:\Windows\Apk_Manager_5.0.1\other\..\projects\framework-res.apk\res\values\publ
ic.xml:2678: error: Public symbol string/zzz_low_battery_string declared here is
 not defined.
c:\Windows\Apk_Manager_5.0.1\other\..\projects\framework-res.apk\res\values\publ
ic.xml:2433: error: Public symbol string/zzz_phone_lockscreen_enter_password dec
lared here is not defined.
c:\Windows\Apk_Manager_5.0.1\other\..\projects\framework-res.apk\res\values\publ
ic.xml:2434: error: Public symbol string/zzz_phone_lockscreen_invalid_password d
eclared here is not defined.
c:\Windows\Apk_Manager_5.0.1\other\..\projects\framework-res.apk\res\values\publ
ic.xml:2435: error: Public symbol string/zzz_phone_lockscreen_wrong_password dec
lared here is not defined.
c:\Windows\Apk_Manager_5.0.1\other\..\projects\framework-res.apk\res\values\publ
ic.xml:2670: error: Public symbol string/zzz_puzzle_lock_help_text_1 declared he
re is not defined.
c:\Windows\Apk_Manager_5.0.1\other\..\projects\framework-res.apk\res\values\publ
ic.xml:2671: error: Public symbol string/zzz_puzzle_lock_help_text_2 declared he
re is not defined.
c:\Windows\Apk_Manager_5.0.1\other\..\projects\framework-res.apk\res\values\publ
ic.xml:2680: error: Public symbol string/zzz_skt_missing_sim_message1 declared h
ere is not defined.
c:\Windows\Apk_Manager_5.0.1\other\..\projects\framework-res.apk\res\values\publ
ic.xml:2681: error: Public symbol string/zzz_skt_missing_sim_message2 declared h
ere is not defined.
c:\Windows\Apk_Manager_5.0.1\other\..\projects\framework-res.apk\res\values\publ
ic.xml:2682: error: Public symbol string/zzz_skt_usim_not_used declared here is
not defined.
c:\Windows\Apk_Manager_5.0.1\other\..\projects\framework-res.apk\res\values\publ
ic.xml:2667: error: Public symbol string/zzz_smart_unlock_help_text_1 declared h
ere is not defined.
c:\Windows\Apk_Manager_5.0.1\other\..\projects\framework-res.apk\res\values\publ
ic.xml:2668: error: Public symbol string/zzz_smart_unlock_help_text_2 declared h
ere is not defined.
c:\Windows\Apk_Manager_5.0.1\other\..\projects\framework-res.apk\res\values\publ
ic.xml:2669: error: Public symbol string/zzz_smart_unlock_sorry_text declared he
re is not defined.
c:\Windows\Apk_Manager_5.0.1\other\..\projects\framework-res.apk\res\values\publ
ic.xml:2719: error: Public symbol string/zzzzz_tw_cursor_handle_choosertitle_sha
re declared here is not defined.
c:\Windows\Apk_Manager_5.0.1\other\..\projects\framework-res.apk\res\values\publ
ic.xml:2721: error: Public symbol string/zzzzz_tw_cursor_handle_choosertitle_sha
revia declared here is not defined.
c:\Windows\Apk_Manager_5.0.1\other\..\projects\framework-res.apk\res\values\publ
ic.xml:2720: error: Public symbol string/zzzzz_tw_cursor_handle_clipboard declar
ed here is not defined.
c:\Windows\Apk_Manager_5.0.1\other\..\projects\framework-res.apk\res\values\publ
ic.xml:2717: error: Public symbol string/zzzzz_tw_cursor_handle_popup_search dec
lared here is not defined.
Exception in thread "main" brut.androlib.AndrolibException: brut.common.BrutExce
ption: could not exec command: [aapt, p, -F, C:\Users\Inger\AppData\Local\Temp\A
PKTOOL8740974017872797577.tmp, -x, -S, c:\Windows\Apk_Manager_5.0.1\other\..\pro
jects\framework-res.apk\res, -M, c:\Windows\Apk_Manager_5.0.1\other\..\projects\
framework-res.apk\AndroidManifest.xml]
        at brut.androlib.res.AndrolibResources.aaptPackage(Unknown Source)
        at brut.androlib.Androlib.buildResourcesFull(Unknown Source)
        at brut.androlib.Androlib.buildResources(Unknown Source)
        at brut.androlib.Androlib.build(Unknown Source)
        at brut.androlib.Androlib.build(Unknown Source)
        at brut.apktool.Main.cmdBuild(Unknown Source)
        at brut.apktool.Main.main(Unknown Source)
Caused by: brut.common.BrutException: could not exec command: [aapt, p, -F, C:\U
sers\Inger\AppData\Local\Temp\APKTOOL8740974017872797577.tmp, -x, -S, c:\Windows
\Apk_Manager_5.0.1\other\..\projects\framework-res.apk\res, -M, c:\Windows\Apk_M
anager_5.0.1\other\..\projects\framework-res.apk\AndroidManifest.xml]
        at brut.util.OS.exec(Unknown Source)
        ... 7 more
Det går inte att hitta filen.
Tryck ned valfri tangent för att fortsätta...

Read More
Thread Closed Subscribe to Thread

Tags
android development, apk editing, apk manager 5.0, apk manger, apktool
Previous Thread Next Thread
Thread Tools Search this Thread
Search this Thread:

Advanced Search
Display Modes