FORUMS
Remove All Ads from XDA

[TOOL] APK Easy Tool 1.55 (Windows) (11 may 2019)

1,451 posts
Thanks Meter: 642
 
By evildog1, Senior Member on 11th March 2016, 11:37 AM
Post Reply Email Thread
15th June 2019, 12:53 PM |#521  
Dronzerr's Avatar
Member
Flag Mumbai
Thanks Meter: 22
 
More
Quote:
Originally Posted by DIXES

I tried using this tool to unpack this APK, jp.naver.line.android_9.2.2.apk, and it rebuild failed even without any change.
Actually I just want to modify its "AndroidManifest.xml" for enabling adb backup feature. Is there any solution? Thanks.

Code:
I: Using Apktool 2.4.0
I: Smaling smali folder into classes.dex...
I: Smaling smali_classes2 folder into classes2.dex...
I: Smaling smali_classes3 folder into classes3.dex...
I: Smaling smali_classes4 folder into classes4.dex...
I: Smaling smali_classes5 folder into classes5.dex...
I: Smaling smali_classes6 folder into classes6.dex...
I: Smaling smali_classes7 folder into classes7.dex...
I: Building resources...
brut.androlib.AndrolibException: brut.common.BrutException: could not exec: [C:\Users\user\AppData\Local\Temp\brut_util_Jar_9159427495816239180.tmp, p, --forced-package-id, 127, --min-sdk-version, 19, --target-sdk-version, 27, --version-code, 19090202, --version-name, 9.2.2, --no-version-vectors, -F, C:\Users\user\AppData\Local\Temp\APKTOOL757651693556279222.tmp, -0, arsc, -0, assets/M_SenseME_Face_Video_5.3.0_v1.model, -0, assets/M_SenseME_Segment_1.5.0.model, -0, assets/Y_Vision_1.0.0.tflite, -0, png, -0, assets/drawable/weibosdk_dialog_bg.9.png, -0, assets/looks/face_mask, -0, assets/looks/lip_mask, -0, assets/looks/lip_mask_gradation, -0, dat, -0, res/drawable-hdpi-v4/abc_ab_share_pack_mtrl_alpha.9.png, -0, res/drawable-hdpi-v4/abc_btn_switch_to_on_mtrl_00001.9.png, -0, res/drawable-hdpi-v4/abc_btn_switch_to_on_mtrl_00012.9.png, -0, res/drawable-hdpi-v4............
............


+1
 
 
27th June 2019, 07:01 AM |#522  
Junior Member
Thanks Meter: 1
 
More
Hi,
I want to modify AndroidManifest.xml. How can I do this with your tool?
History: I have decompiled apk, but AndroidManifest.xml contains binary data, not readable text.
27th June 2019, 08:20 AM |#523  
Junior Member
Thanks Meter: 1
 
More
I found solution: uncheck option "Don't decode resources.arsc"
The Following User Says Thank You to Sann-X! For This Useful Post: [ View ] Gift Sann-X! Ad-Free
29th June 2019, 11:38 PM |#524  
N'ayam Amarsh'e's Avatar
Senior Member
Thanks Meter: 547
 
Donate to Me
More
Can I ask how do you save the original signature of an apk? I wanna do something in apktool on linux but need to save original signature. Any workarounds?

Sent from my Avocado using Tapatalk
4th July 2019, 03:06 PM |#525  
aspee's Avatar
Senior Member
Flag mumbai
Thanks Meter: 1,063
 
More
how to decompile framework-res.apk in oxygen os?
got below error
W: C:\Users\orlon\Documents\APK Easy Tool\1-Decompiled APKs\framework-res\res\values\attrs.xml:2522: error: invalid value for type 'attr'. Expected a reference.
W: C:\Users\orlon\Documents\APK Easy Tool\1-Decompiled APKs\framework-res\res\values\attrs.xml:2523: error: invalid value for type 'attr'. Expected a reference.
W: C:\Users\orlon\Documents\APK Easy Tool\1-Decompiled APKs\framework-res\res\values\attrs.xml:2524: error: invalid value for type 'attr'. Expected a reference.
W: C:\Users\orlon\Documents\APK Easy Tool\1-Decompiled APKs\framework-res\res\values\attrs.xml:2525: error: invalid value for type 'attr'. Expected a reference.
W: C:\Users\orlon\Documents\APK Easy Tool\1-Decompiled APKs\framework-res\res\values\attrs.xml:2526: error: invalid value for type 'attr'. Expected a reference.
W: C:\Users\orlon\Documents\APK Easy Tool\1-Decompiled APKs\framework-res\res\values\attrs.xml:2527: error: invalid value for type 'attr'. Expected a reference.
W: C:\Users\orlon\Documents\APK Easy Tool\1-Decompiled APKs\framework-res\res\values\attrs.xml:2528: error: invalid value for type 'attr'. Expected a reference.
W: C:\Users\orlon\Documents\APK Easy Tool\1-Decompiled APKs\framework-res\res\values\attrs.xml:2529: error: invalid value for type 'attr'. Expected a reference.
W: C:\Users\orlon\Documents\APK Easy Tool\1-Decompiled APKs\framework-res\res\values\attrs.xml:2530: error: invalid value for type 'attr'. Expected a reference.
W: C:\Users\orlon\Documents\APK Easy Tool\1-Decompiled APKs\framework-res\res\values\attrs.xml:2531: error: invalid value for type 'attr'. Expected a reference.
W: C:\Users\orlon\Documents\APK Easy Tool\1-Decompiled APKs\framework-res\res\values\attrs.xml:2532: error: invalid value for type 'attr'. Expected a reference.
W: C:\Users\orlon\Documents\APK Easy Tool\1-Decompiled APKs\framework-res\res\values\attrs.xml:2533: error: invalid value for type 'attr'. Expected a reference.
W: C:\Users\orlon\Documents\APK Easy Tool\1-Decompiled APKs\framework-res\res\values\attrs.xml:2534: error: invalid value for type 'attr'. Expected a reference.
W: C:\Users\orlon\Documents\APK Easy Tool\1-Decompiled APKs\framework-res\res\values\attrs.xml:2535: error: invalid value for type 'attr'. Expected a reference.
W: C:\Users\orlon\Documents\APK Easy Tool\1-Decompiled APKs\framework-res\res\values\attrs.xml:2536: error: invalid value for type 'attr'. Expected a reference.
W: C:\Users\orlon\Documents\APK Easy Tool\1-Decompiled APKs\framework-res\res\values\attrs.xml:2537: error: invalid value for type 'attr'. Expected a reference.
W: C:\Users\orlon\Documents\APK Easy Tool\1-Decompiled APKs\framework-res\res\values\attrs.xml:2538: error: invalid value for type 'attr'. Expected a reference.
W: C:\Users\orlon\Documents\APK Easy Tool\1-Decompiled APKs\framework-res\res\values\attrs.xml:2539: error: invalid value for type 'attr'. Expected a reference.
W: C:\Users\orlon\Documents\APK Easy Tool\1-Decompiled APKs\framework-res\res\values\attrs.xml:2540: error: invalid value for type 'attr'. Expected a reference.
W: C:\Users\orlon\Documents\APK Easy Tool\1-Decompiled APKs\framework-res\res\values\attrs.xml:2541: error: invalid value for type 'attr'. Expected a reference.
brut.androlib.AndrolibException: brut.common.BrutException: could not exec (exit code = 1): [C:\Users\orlon\AppData\Local\Temp\brut_util_Jar_19 77459320033229621.tmp, compile, --dir, C:\Users\orlon\Documents\APK Easy Tool\1-Decompiled APKs\framework-res\res, --legacy, -o, C:\Users\orlon\Documents\APK Easy Tool\1-Decompiled APKs\framework-res\build\resources.zip]
7th July 2019, 04:28 PM |#526  
Quote:
Originally Posted by N'ayam Amarsh'e

Can I ask how do you save the original signature of an apk? I wanna do something in apktool on linux but need to save original signature. Any workarounds?

Sent from my Avocado using Tapatalk

Extract the meta-inf from the original apk.
Quote:
Originally Posted by aspee

how to decompile framework-res.apk in oxygen os?
got below error
W: C:\Users\orlon\Documents\APK Easy Tool\1-Decompiled APKs\framework-res\res\values\attrs.xml:2522: error: invalid value for type 'attr'. Expected a reference.
W: C:\Users\orlon\Documents\APK Easy Tool\1-Decompiled APKs\framework-res\res\values\attrs.xml:2523: error: invalid value for type 'attr'. Expected a reference.
W: C:\Users\orlon\Documents\APK Easy Tool\1-Decompiled APKs\framework-res\res\values\attrs.xml:2524: error: invalid value for type 'attr'. Expected a reference.
W: C:\Users\orlon\Documents\APK Easy Tool\1-Decompiled APKs\framework-res\res\values\attrs.xml:2525: error: invalid value for type 'attr'. Expected a reference.
W: C:\Users\orlon\Documents\APK Easy Tool\1-Decompiled APKs\framework-res\res\values\attrs.xml:2526: error: invalid value for type 'attr'. Expected a reference.
W: C:\Users\orlon\Documents\APK Easy Tool\1-Decompiled APKs\framework-res\res\values\attrs.xml:2527: error: invalid value for type 'attr'. Expected a reference.
W: C:\Users\orlon\Documents\APK Easy Tool\1-Decompiled APKs\framework-res\res\values\attrs.xml:2528: error: invalid value for type 'attr'. Expected a reference.
W: C:\Users\orlon\Documents\APK Easy Tool\1-Decompiled APKs\framework-res\res\values\attrs.xml:2529: error: invalid value for type 'attr'. Expected a reference.
W: C:\Users\orlon\Documents\APK Easy Tool\1-Decompiled APKs\framework-res\res\values\attrs.xml:2530: error: invalid value for type 'attr'. Expected a reference.
W: C:\Users\orlon\Documents\APK Easy Tool\1-Decompiled APKs\framework-res\res\values\attrs.xml:2531: error: invalid value for type 'attr'. Expected a reference.
W: C:\Users\orlon\Documents\APK Easy Tool\1-Decompiled APKs\framework-res\res\values\attrs.xml:2532: error: invalid value for type 'attr'. Expected a reference.
W: C:\Users\orlon\Documents\APK Easy Tool\1-Decompiled APKs\framework-res\res\values\attrs.xml:2533: error: invalid value for type 'attr'. Expected a reference.
W: C:\Users\orlon\Documents\APK Easy Tool\1-Decompiled APKs\framework-res\res\values\attrs.xml:2534: error: invalid value for type 'attr'. Expected a reference.
W: C:\Users\orlon\Documents\APK Easy Tool\1-Decompiled APKs\framework-res\res\values\attrs.xml:2535: error: invalid value for type 'attr'. Expected a reference.
W: C:\Users\orlon\Documents\APK Easy Tool\1-Decompiled APKs\framework-res\res\values\attrs.xml:2536: error: invalid value for type 'attr'. Expected a reference.
W: C:\Users\orlon\Documents\APK Easy Tool\1-Decompiled APKs\framework-res\res\values\attrs.xml:2537: error: invalid value for type 'attr'. Expected a reference.
W: C:\Users\orlon\Documents\APK Easy Tool\1-Decompiled APKs\framework-res\res\values\attrs.xml:2538: error: invalid value for type 'attr'. Expected a reference.
W: C:\Users\orlon\Documents\APK Easy Tool\1-Decompiled APKs\framework-res\res\values\attrs.xml:2539: error: invalid value for type 'attr'. Expected a reference.
W: C:\Users\orlon\Documents\APK Easy Tool\1-Decompiled APKs\framework-res\res\values\attrs.xml:2540: error: invalid value for type 'attr'. Expected a reference.
W: C:\Users\orlon\Documents\APK Easy Tool\1-Decompiled APKs\framework-res\res\values\attrs.xml:2541: error: invalid value for type 'attr'. Expected a reference.
brut.androlib.AndrolibException: brut.common.BrutException: could not exec (exit code = 1): [C:\Users\orlon\AppData\Local\Temp\brut_util_Jar_19 77459320033229621.tmp, compile, --dir, C:\Users\orlon\Documents\APK Easy Tool\1-Decompiled APKs\framework-res\res, --legacy, -o, C:\Users\orlon\Documents\APK Easy Tool\1-Decompiled APKs\framework-res\build\resources.zip]

Have you installed the framework-res apk?
9th July 2019, 04:38 PM |#527  
Junior Member
Thanks Meter: 0
 
More
Downloaded and installed apk easy tool 1.55. decompile any apk and try to recompile it fails. Not even touching any of the code just decompile recompile and it fails....please help...

7/9/2019 11:34:00 AM
Compiling APK file... (CMD mode: WriteLine)

/c "java -Xmx1024m -jar "C:\Program Files\APK Easy Tool\Apktool\apktool_2.4.0.jar" b -f -o "C:\Users\flroy\OneDrive\Documents\APK Easy Tool\2-Recompiled APKs\TV_APP_UNBRANDED_V2.1.apk" "C:\Users\flroy\Documents\APK Easy Tool\1-Decompiled APKs\TV_APP_UNBRANDED_V2.1" "

I: Using Apktool 2.4.0
I: Smaling smali folder into classes.dex...
I: Smaling smali_classes2 folder into classes2.dex...
I: Building resources...
brut.androlib.AndrolibException: brut.common.BrutException: could not exec (exit code = -1073741515): [C:\Users\flroy\AppData\Local\Temp\brut_util_Jar_29 24982857391051689.tmp, p, --forced-package-id, 127, --min-sdk-version, 17, --target-sdk-version, 27, --version-code, 60, --version-name, 2.1, --no-version-vectors, -F, C:\Users\flroy\AppData\Local\Temp\APKTOOL797287783 4028624696.tmp, -0, arsc, -0, res/drawable-hdpi-v4/abc_ab_share_pack_mtrl_alpha.9.png, -0, png, -0, res/drawable-hdpi-v4/abc_btn_switch_to_on_mtrl_00001.9.png, -0, res/drawable-hdpi-v4/abc_btn_switch_to_on_mtrl_00012.9.png, -0, res/drawable-hdpi-v4/abc_cab_background_top_mtrl_alpha.9.png, -0, res/drawable-hdpi-v4/abc_list_divider_mtrl_alpha.9.png, -0, res/drawable-hdpi-v4/abc_list_focused_holo.9.png, -0, res/drawable-hdpi-v4/abc_list_longpressed_holo.9.png, -0, res/drawable-hdpi-v4/abc_list_pressed_holo_dark.9.png, -0, res/drawable-hdpi-v4/abc_list_pressed_holo_light.9.png, -0, res/drawable-hdpi-
9th July 2019, 09:17 PM |#528  
evildog1's Avatar
OP Senior Member
Thanks Meter: 642
 
Donate to Me
More
Quote:
Originally Posted by Fredxxxx

Downloaded and installed apk easy tool 1.55. decompile any apk and try to recompile it fails. Not even touching any of the code just decompile recompile and it fails....please help...

Known issue:
https://github.com/msintuneappsdk/in...roid/issues/27
The Following User Says Thank You to evildog1 For This Useful Post: [ View ] Gift evildog1 Ad-Free
10th July 2019, 07:19 PM |#529  
Junior Member
Thanks Meter: 0
 
More
Apk easy tool suddenly stopped working
i was using the software for like 4 months but suddenly after decompiling some apks do some changes on the codes and trying to compile it gives me an error and tells me to check the log and here's what i get :

Code:
I: Using Apktool 2.4.0
I: Smaling smali folder into classes.dex...
..\1-Decompiled APKs\galaxy\smali\com\zoozoo\filter\BaseActivity$1.smali[1,11] Error for input '.zoozoo': Invalid directive
..\1-Decompiled APKs\galaxy\smali\com\zoozoo\filter\BaseActivity$1.smali[1,18] Error for input '.filter': Invalid directive
..\1-Decompiled APKs\galaxy\smali\com\zoozoo\filter\BaseActivity$1.smali[1,25] Error for input '/': Invalid text
..\1-Decompiled APKs\galaxy\smali\com\zoozoo\filter\BaseActivity$1.smali[1,7] mismatched input 'Lcom' expecting CLASS_DESCRIPTOR
..\1-Decompiled APKs\galaxy\smali\com\zoozoo\filter\BaseActivity$1.smali[1,40] Error for input ';': Invalid text
..\1-Decompiled APKs\galaxy\smali\com\zoozoo\filter\BaseActivity$1.smali[11,16] Error for input '.zoozoo': Invalid directive
..\1-Decompiled APKs\galaxy\smali\com\zoozoo\filter\BaseActivity$1.smali[11,23] Error for input '.filter': Invalid directive
..\1-Decompiled APKs\galaxy\smali\com\zoozoo\filter\BaseActivity$1.smali[11,30] Error for input '/': Invalid text
..\1-Decompiled APKs\galaxy\smali\com\zoozoo\filter\BaseActivity$1.smali[11,31] no viable alternative at input 'BaseActivity'
..\1-Decompiled APKs\galaxy\smali\com\zoozoo\filter\BaseActivity$1.smali[11,43] Error for input ';': Invalid text
..\1-Decompiled APKs\galaxy\smali\com\zoozoo\filter\BaseActivity$1.smali[11,31] missing EQUAL at 'BaseActivity'
..\1-Decompiled APKs\galaxy\smali\com\zoozoo\filter\BaseActivity$1.smali[11,44] mismatched input '->' expecting EQUAL
..\1-Decompiled APKs\galaxy\smali\com\zoozoo\filter\BaseActivity$1.smali[11,63] missing EQUAL at '('
..\1-Decompiled APKs\galaxy\smali\com\zoozoo\filter\BaseActivity$1.smali[21,30] no viable alternative at input 'Lcom'
..\1-Decompiled APKs\galaxy\smali\com\zoozoo\filter\BaseActivity$1.smali[21,34] Error for input '.zoozoo': Invalid directive
..\1-Decompiled APKs\galaxy\smali\com\zoozoo\filter\BaseActivity$1.smali[21,41] Error for input '.filter': Invalid directive
..\1-Decompiled APKs\galaxy\smali\com\zoozoo\filter\BaseActivity$1.smali[21,48] Error for input '/': Invalid text
..\1-Decompiled APKs\galaxy\smali\com\zoozoo\filter\BaseActivity$1.smali[21,61] Error for input ';': Invalid text
..\1-Decompiled APKs\galaxy\smali\com\zoozoo\filter\BaseActivity$1.smali[29,27] no viable alternative at input 'Lcom'
..\1-Decompiled APKs\galaxy\smali\com\zoozoo\filter\BaseActivity$1.smali[29,31] Error for input '.zoozoo': Invalid directive
..\1-Decompiled APKs\galaxy\smali\com\zoozoo\filter\BaseActivity$1.smali[29,38] Error for input '.filter': Invalid directive
..\1-Decompiled APKs\galaxy\smali\com\zoozoo\filter\BaseActivity$1.smali[29,45] Error for input '/': Invalid text
..\1-Decompiled APKs\galaxy\smali\com\zoozoo\filter\BaseActivity$1.smali[29,58] Error for input ';': Invalid text
..\1-Decompiled APKs\galaxy\smali\com\zoozoo\filter\BaseActivity$1.smali[33,28] Error for input '.zoozoo': Invalid directive
..\1-Decompiled APKs\galaxy\smali\com\zoozoo\filter\BaseActivity$1.smali[33,35] Error for input '.filter': Invalid directive
..\1-Decompiled APKs\galaxy\smali\com\zoozoo\filter\BaseActivity$1.smali[33,42] Error for input '/': Invalid text
..\1-Decompiled APKs\galaxy\smali\com\zoozoo\filter\BaseActivity$1.smali[33,57] Error for input ';': Invalid text
..\1-Decompiled APKs\galaxy\smali\com\zoozoo\filter\BaseActivity$1.smali[33,43] mismatched input 'BaseActivity$1' expecting COLON
..\1-Decompiled APKs\galaxy\smali\com\zoozoo\filter\BaseActivity$1.smali[33,71] Error for input '.zoozoo': Invalid directive
..\1-Decompiled APKs\galaxy\smali\com\zoozoo\filter\BaseActivity$1.smali[33,78] Error for input '.filter': Invalid directive
..\1-Decompiled APKs\galaxy\smali\com\zoozoo\filter\BaseActivity$1.smali[33,85] Error for input '/': Invalid text
..\1-Decompiled APKs\galaxy\smali\com\zoozoo\filter\BaseActivity$1.smali[33,98] Error for input ';': Invalid text
..\1-Decompiled APKs\galaxy\smali\com\zoozoo\filter\BaseActivity$1.smali[33,86] mismatched input 'BaseActivity' expecting END_METHOD_DIRECTIVE
..\1-Decompiled APKs\galaxy\smali\com\zoozoo\filter\BaseActivity$1.smali[35,28] Error for input '.zoozoo': Invalid directive
..\1-Decompiled APKs\galaxy\smali\com\zoozoo\filter\BaseActivity$1.smali[35,35] Error for input '.filter': Invalid directive
..\1-Decompiled APKs\galaxy\smali\com\zoozoo\filter\BaseActivity$1.smali[35,42] Error for input '/': Invalid text
..\1-Decompiled APKs\galaxy\smali\com\zoozoo\filter\BaseActivity$1.smali[35,57] Error for input ';': Invalid text
..\1-Decompiled APKs\galaxy\smali\com\zoozoo\filter\BaseActivity$1.smali[37,21] Error for input '.zoozoo': Invalid directive
..\1-Decompiled APKs\galaxy\smali\com\zoozoo\filter\BaseActivity$1.smali[37,28] Error for input '.filter': Invalid directive
..\1-Decompiled APKs\galaxy\smali\com\zoozoo\filter\BaseActivity$1.smali[37,35] Error for input '/': Invalid text
..\1-Decompiled APKs\galaxy\smali\com\zoozoo\filter\BaseActivity$1.smali[37,50] Error for input ';': Invalid text
..\1-Decompiled APKs\galaxy\smali\com\zoozoo\filter\BaseActivity$1.smali[50,28] Error for input '.zoozoo': Invalid directive
..\1-Decompiled APKs\galaxy\smali\com\zoozoo\filter\BaseActivity$1.smali[50,35] Error for input '.filter': Invalid directive
..\1-Decompiled APKs\galaxy\smali\com\zoozoo\filter\BaseActivity$1.smali[50,42] Error for input '/': Invalid text
..\1-Decompiled APKs\galaxy\smali\com\zoozoo\filter\BaseActivity$1.smali[50,57] Error for input ';': Invalid text
..\1-Decompiled APKs\galaxy\smali\com\zoozoo\filter\BaseActivity$1.smali[50,43] mismatched input 'BaseActivity$1' expecting COLON
..\1-Decompiled APKs\galaxy\smali\com\zoozoo\filter\BaseActivity$1.smali[50,71] Error for input '.zoozoo': Invalid directive
..\1-Decompiled APKs\galaxy\smali\com\zoozoo\filter\BaseActivity$1.smali[50,78] Error for input '.filter': Invalid directive
..\1-Decompiled APKs\galaxy\smali\com\zoozoo\filter\BaseActivity$1.smali[50,85] Error for input '/': Invalid text
..\1-Decompiled APKs\galaxy\smali\com\zoozoo\filter\BaseActivity$1.smali[50,98] Error for input ';': Invalid text
..\1-Decompiled APKs\galaxy\smali\com\zoozoo\filter\BaseActivity$1.smali[50,86] mismatched input 'BaseActivity' expecting END_METHOD_DIRECTIVE
..\1-Decompiled APKs\galaxy\smali\com\zoozoo\filter\BaseActivity$1.smali[56,28] Error for input '.zoozoo': Invalid directive
..\1-Decompiled APKs\galaxy\smali\com\zoozoo\filter\BaseActivity$1.smali[56,35] Error for input '.filter': Invalid directive
..\1-Decompiled APKs\galaxy\smali\com\zoozoo\filter\BaseActivity$1.smali[56,42] Error for input '/': Invalid text
..\1-Decompiled APKs\galaxy\smali\com\zoozoo\filter\BaseActivity$1.smali[56,57] Error for input ';': Invalid text
..\1-Decompiled APKs\galaxy\smali\com\zoozoo\filter\BaseActivity$1.smali[62,21] Error for input '.zoozoo': Invalid directive
..\1-Decompiled APKs\galaxy\smali\com\zoozoo\filter\BaseActivity$1.smali[62,28] Error for input '.filter': Invalid directive
..\1-Decompiled APKs\galaxy\smali\com\zoozoo\filter\BaseActivity$1.smali[62,35] Error for input '/': Invalid text
..\1-Decompiled APKs\galaxy\smali\com\zoozoo\filter\BaseActivity$1.smali[62,50] Error for input ';': Invalid text
Could not smali file: com/zoozoo/filter/BaseActivity$1.smali
14th July 2019, 05:40 PM |#530  
YoUnEs DeX's Avatar
Senior Member
Thanks Meter: 33
 
More
------------------------------------------
14/07/2019 17:31:07
Compiling APK file... (CMD mode: WriteLine)

/c "java -Xmx1024m -jar "C:\Program Files\APK Easy Tool\Apktool\apktool_2.4.0.jar" b -f -o "E:\Google\APK Easy Tool v1.50 portable\2-Recompiled APKs\Word Puzzle 2018_apkpure.com.apk" "E:\Google\APK Easy Tool v1.50 portable\1-Decompiled APKs\Word Puzzle 2018_apkpure.com" "

I: Using Apktool 2.4.0
I: Smaling smali folder into classes.dex...
I: Building resources...
S: WARNING: Could not write to (C:\Users\youne\AppData\Local\apktool\framework), using C:\Users\youne\AppData\Local\Temp\ instead...
S: Please be aware this is a volatile directory and frameworks could go missing, please utilize --frame-path if the default storage directory is unavailable
brut.androlib.AndrolibException: brut.common.BrutException: could not exec (exit code = -1073741515): C:\Users\youne\AppData\Local\Temp\brut_util_Jar_41 38086287384117997.tmp, p, --forced-package-id, 127, --min-sdk-version, 14, --target-sdk-version, 27, --version-code, 2, --version-name, 1.1, --no-version-vectors, -F, C:\Users\youne\AppData\Local\Temp\APKTOOL315610139 6646264501.tmp, -0, arsc, -0, png, -0, res/drawable-hdpi-v4/notification_bg_low_normal.9.png, -0, res/drawable-hdpi-v4/notification_bg_low_pressed.9.png, -0, res/drawable-hdpi-v4/notification_bg_normal.9.png, -0, res/drawable-hdpi-v4/notification_bg_normal_pressed.9.png, -0, res/drawable-mdpi-v4/notification_bg_low_normal.9.png, -0, res/drawable-mdpi-v4/notification_bg_low_pressed.9.png, -0, res/drawable-mdpi-v4/notification_bg_normal.9.png, -0, res/drawable-mdpi-v4/notification_bg_normal_pressed.9.png, -0, res/drawable-xhdpi-v4/notification_bg_low_normal.9.png, -0, res/drawable-xhdpi-v4/notification_bg_low_pressed.9.png, -0, res/drawable-xhdpi-v4/notification_bg_normal.9.png, -0, res/drawable-xhdpi-v4/notification_bg_normal_pressed.9.png, -0, arsc, -I, C:\Users\youne\AppData\Local\Temp\1.apk, -S, E:\Google\APK Easy Tool v1.50 portable\1-Decompiled APKs\Word Puzzle 2018_apkpure.com\res, -M, E:\Google\APK Easy Tool v1.50 portable\1-Decompiled APKs\Word Puzzle 2018_apkpure.com\AndroidManifest.xml]
Post Reply Subscribe to Thread

Guest Quick Reply (no urls or BBcode)
Message:
Previous Thread Next Thread
Thread Tools Search this Thread
Search this Thread:

Advanced Search
Display Modes