Cm12.1 build error

Search This thread

rpdroky

Senior Member
Nov 13, 2014
710
1,683
host C++: libart-compiler <= art/compiler/compiled_method.cc
libcore/luni/src/main/native/Register.cpp:36: error: undefined reference to 'register_android_system_OsConstants(_JNIEnv*)'
clang: error: linker command failed with exit code 1 (use -v to see invocation)
make: *** [/home/relocate/cm12.1/out/host/linux-x86/obj32/lib/libjavacore.so] Error 1
make: *** Waiting for unfinished jobs....
make: Leaving directory `/home/relocate/cm12.1'

#### make failed to build some targets (48:23 (mm:ss)) ####

i keep geting this error , can someone help me out with it please?

Thanks in advance
 

kozmo21

Inactive Recognized Contributor
Jun 4, 2010
1,375
1,917
host C++: libart-compiler <= art/compiler/compiled_method.cc
libcore/luni/src/main/native/Register.cpp:36: error: undefined reference to 'register_android_system_OsConstants(_JNIEnv*)'
clang: error: linker command failed with exit code 1 (use -v to see invocation)
make: *** [/home/relocate/cm12.1/out/host/linux-x86/obj32/lib/libjavacore.so] Error 1
make: *** Waiting for unfinished jobs....
make: Leaving directory `/home/relocate/cm12.1'

#### make failed to build some targets (48:23 (mm:ss)) ####

i keep geting this error , can someone help me out with it please?

Thanks in advance
Not sure, but see if this post helps... http://forum.xda-developers.com/showpost.php?p=58073796&postcount=5
 
  • Like
Reactions: rpdroky

rpdroky

Senior Member
Nov 13, 2014
710
1,683
i want to change the default governor , can someone point me to the files i need to change? Thanks in advance :fingers-crossed:
 

Top Liked Posts

  • There are no posts matching your filters.
  • 1
    host C++: libart-compiler <= art/compiler/compiled_method.cc
    libcore/luni/src/main/native/Register.cpp:36: error: undefined reference to 'register_android_system_OsConstants(_JNIEnv*)'
    clang: error: linker command failed with exit code 1 (use -v to see invocation)
    make: *** [/home/relocate/cm12.1/out/host/linux-x86/obj32/lib/libjavacore.so] Error 1
    make: *** Waiting for unfinished jobs....
    make: Leaving directory `/home/relocate/cm12.1'

    #### make failed to build some targets (48:23 (mm:ss)) ####

    i keep geting this error , can someone help me out with it please?

    Thanks in advance
    Not sure, but see if this post helps... http://forum.xda-developers.com/showpost.php?p=58073796&postcount=5
Our Apps
Get our official app!
The best way to access XDA on your phone
Nav Gestures
Add swipe gestures to any Android
One Handed Mode
Eases uses one hand with your phone